{"text_format":"3","workbook":"xlsx","n_sheets":3,"sheets":["Tabelle1","§ 13 RVG","§ 49 RVG"],"not_rendered":{"defined_names":3,"comments":1},"read":"whole","date_system":"1900"}

{"sheet":"Tabelle1","index":0,"n_rows":25,"n_cols":10,"rows_kept":25,"merged":[[15,1,15,2],[21,0,22,0]]}
["Rechtsanwaltsvergütung nach dem RVG (Stand 01.08.2013)",{"$nulls":5},{"$f":"(C4+C5)*VLOOKUP(B4,'§ 13 RVG'!A1:B250,2)","v":{"v":58.5,"d":"58.50 €"}},{"$f":"(C4+C5)*VLOOKUP(B4,'§ 49 RVG'!A1:B24,2)","v":{"v":58.5,"d":"58.50 €"}},{"$f":"C8*VLOOKUP(B8,'§ 13 RVG'!A1:B250,2)","v":{"v":45,"d":"45.00 €"}},{"$f":"C8*VLOOKUP(B8,'§ 49 RVG'!A1:B24,2)","v":{"v":45,"d":"45.00 €"}}]
[{"$nulls":6},{"$f":"IF(B6=0,0,C6*VLOOKUP(B6,'§ 13 RVG'!$A$1:$B$250,2))","v":0},{"$f":"IF(B6=0,0,C6*VLOOKUP(B6,'§ 49 RVG'!$A$1:$B$24,2))","v":0},{"$f":"IF(B9=0,0,C9*VLOOKUP(B9,'§ 13 RVG'!$A$1:$B$250,2))","v":0},{"$f":"IF(B9=0,0,C9*VLOOKUP(B9,'§ 49 RVG'!$A$1:$B$24,2))","v":0}]
[null,"Streitwert","Gebührensatz","Wahlanwalt § 13 RVG","PKH § 49 RVG",null,{"$f":"SUM(G1:G2)","v":{"v":58.5,"d":"58.50 €"}},{"$f":"SUM(H1:H2)","v":{"v":58.5,"d":"58.50 €"}},{"$f":"SUM(I1:I2)","v":{"v":45,"d":"45.00 €"}},{"$f":"SUM(J1:J2)","v":{"v":45,"d":"45.00 €"}}]
["Verfahrensgebühr",{"v":500,"d":"500.00 €"},1.3,{"$f":"C4*VLOOKUP(B4,'§ 13 RVG'!$A$1:$B$250,2)","v":{"v":58.5,"d":"58.50 €"}},{"$f":"C4*VLOOKUP(B4,'§ 49 RVG'!A1:B19,2)","v":{"v":58.5,"d":"58.50 €"}},null,{"$f":"(C4+C5)*VLOOKUP((B4+B6),'§ 13 RVG'!$A$1:$B$250,2)","v":{"v":58.5,"d":"58.50 €"}},{"$f":"(C4+C5)*VLOOKUP((B4+B6),'§ 49 RVG'!$A$1:$B$250,2)","v":{"v":58.5,"d":"58.50 €"}},{"$f":"C9*VLOOKUP((B8+B9),'§ 13 RVG'!$A$1:$B$250,2)","v":{"v":67.5,"d":"67.50 €"}},{"$f":"C9*VLOOKUP((B8+B9),'§ 49 RVG'!$A$1:$B$24,2)","v":{"v":67.5,"d":"67.50 €"}}]
["mehrere Auftraggeber",0,{"$f":"IF(B5*0.3<=2,B5*0.3,2)","v":0},{"$f":"IF(B5=0,0,C5*VLOOKUP(B4,'§ 13 RVG'!A1:B250,2))","v":0},{"$f":"IF(B5=0,0,C5*VLOOKUP(B4,'§ 49 RVG'!A1:B19,2))","v":0},null,{"$f":"G4-G1","v":0},{"$f":"H4-H1","v":0},{"$f":"I4-I1","v":{"v":22.5,"d":"22.50 €"}},{"$f":"J4-J1","v":{"v":22.5,"d":"22.50 €"}}]
["Verfahrensgeb. bei Mehrvergl.",0,{"$f":"0.8+C5","v":0.8},{"$f":"IF(B6=0,0,IF(G4<G3,G5,G2))","v":0},{"$f":"IF(B6=0,0,IF(H4<H3,H5,H2))","v":0}]
["Terminsgebühr",{"$f":"B4","v":{"v":500,"d":"500.00 €"}},1.2,{"$f":"IF(B7=0,0,C7*VLOOKUP(B7,'§ 13 RVG'!$A$1:$B$250,2))","v":{"v":54,"d":"54.00 €"}},{"$f":"IF(B7=0,0,C7*VLOOKUP(B7,'§ 49 RVG'!$A$1:$B$19,2))","v":{"v":54,"d":"54.00 €"}}]
["Einigungsgebühr",0,1,{"$f":"IF(B8=0,0,C8*VLOOKUP(B8,'§ 13 RVG'!$A$1:$B$250,2))","v":0},{"$f":"IF(B8=0,0,C8*VLOOKUP(B8,'§ 49 RVG'!$A$1:$B$19,2))","v":0},null,null,0,25]
["Einigungsgeb. bei Mehrvergl.",{"$f":"B6","v":0},1.5,{"$f":"IF(I4<I3,I5,I2)","v":0},{"$f":"IF(J4<J3,J5,J2)","v":0}]
["Anrechnung Geschäftsgebühr",0,{"v":-0.65,"d":"-0.65 "},{"$f":"IF(B10=0,0,C10*VLOOKUP(B10,'§ 13 RVG'!$A$1:$B$250,2))","v":0},{"$f":"IF(B10=0,0,C10*VLOOKUP(B10,'§ 49 RVG'!$A$1:$B$19,2))","v":0}]
["Bei Anrechnung von Beratungshilfe -35 in die gelbe Zelle einsetzen",null,null,0,0]
["Reisekosten",0,null,{"$f":"B12*0.3","v":0},{"$f":"B12*0.3","v":0},null,null,4.01,40]
["Abwesenheitsgeld",0,null,{"$f":"IF(B13<=0,0,(VLOOKUP(B13,H8:I13,2)))","v":0},{"$f":"IF(B13<=0,0,(VLOOKUP(B13,H8:I13,2)))","v":0},null,null,8.01,70]
["Kopien",0,null,{"$f":"IF(B14<=50,B14*0.5,(50*0.5+(B14-50)*0.15))","v":0},{"$f":"IF(B14<=50,B14*0.5,(50*0.5+(B14-50)*0.15))","v":0},null,{"$f":"SUM(D4:D9)*(20/100)","v":22.5}]
["Auslagen",null,null,{"$f":"IF(G14<20,G14,20)","v":{"v":20,"d":"20.00 €"}},{"$f":"IF(G14<20,G14,20)","v":{"v":20,"d":"20.00 €"}},null,{"$f":"SUM(E4:E9)*20/100","v":{"v":22.5,"d":"22.50 €"}}]
[null,"Summe (ohne U-Steuer):",null,{"$f":"SUM(D4:D15)","v":{"v":132.5,"d":"132.50 €"}},{"$f":"SUM(E4:E15)","v":{"v":132.5,"d":"132.50 €"}}]
["Umsatzsteuer",19,"%",{"$f":"SUM(D4:D15)*(B17/100)","v":{"v":25.175,"d":"25.18 €"}},{"$f":"SUM(E4:E15)*(B17/100)","v":{"v":25.175,"d":"25.18 €"}}]
[null,null,"Summe:",{"$f":"D16+D17","v":{"v":157.675,"d":"157.68 €"}},{"$f":"E16+E17","v":{"v":157.675,"d":"157.68 €"}}]
[null,null,"weitere Vergütung",{"$f":"D18-E18","v":0}]
["Erhaltene Zahlungen",{"v":0,"d":"0.00 €"},"verbleiben",{"$f":"D18-B20","v":{"v":157.675,"d":"157.68 €"}},{"$f":"E18-B20","v":{"v":157.675,"d":"157.68 €"}}]
[]
["Bei Kostenfestsetzung:","Gerichtskosten: ",0,{"$f":"IF(C22<>0,D18+C22+C23,0)","v":0},"Summe Anwalts- und Gerichtskosten"]
[null,"Kosten weiterer Anwalt (Unter- bevollmächtigter pp.)",0,{"$f":"IF(C22<>0,D16+C22+C23,0)","v":0},"Summe Anwalts- und Gerichtskosten bei Vorsteuerabzug"]
["© J. Bitter"]
[null,null," "]

{"sheet":"§ 13 RVG","index":1,"n_rows":250,"n_cols":4,"rows_kept":250,"hidden":true}
[{"v":0,"d":"0.00 €"},{"v":45,"d":"45.00 €"}]
[{"v":500.01,"d":"500.01 €"},{"v":80,"d":"80.00 €"}]
[{"v":1000.01,"d":"1,000.01 €"},{"v":115,"d":"115.00 €"}]
[{"v":1500.01,"d":"1,500.01 €"},{"v":150,"d":"150.00 €"}]
[{"v":2000.01,"d":"2,000.01 €"},{"v":201,"d":"201.00 €"}]
[{"v":3000.01,"d":"3,000.01 €"},{"v":252,"d":"252.00 €"}]
[{"v":4000.01,"d":"4,000.01 €"},{"v":303,"d":"303.00 €"}]
[{"v":5000.01,"d":"5,000.01 €"},{"v":354,"d":"354.00 €"}]
[{"v":6000.01,"d":"6,000.01 €"},{"v":405,"d":"405.00 €"}]
[{"v":7000.01,"d":"7,000.01 €"},{"v":456,"d":"456.00 €"}]
[{"v":8000.01,"d":"8,000.01 €"},{"v":507,"d":"507.00 €"}]
[{"v":9000.01,"d":"9,000.01 €"},{"v":558,"d":"558.00 €"}]
[{"v":10000.01,"d":"10,000.01 €"},{"v":604,"d":"604.00 €"}]
[{"v":13000.01,"d":"13,000.01 €"},{"v":650,"d":"650.00 €"}]
[{"v":16000.01,"d":"16,000.01 €"},{"v":696,"d":"696.00 €"}]
[{"v":19000.01,"d":"19,000.01 €"},{"v":742,"d":"742.00 €"}]
[{"v":22000.01,"d":"22,000.01 €"},{"v":788,"d":"788.00 €"}]
[{"v":25000.01,"d":"25,000.01 €"},{"v":863,"d":"863.00 €"}]
[{"v":30000.01,"d":"30,000.01 €"},{"v":938,"d":"938.00 €"}]
[{"v":35000.01,"d":"35,000.01 €"},{"v":1013,"d":"1,013.00 €"}]
[{"v":40000.01,"d":"40,000.01 €"},{"v":1088,"d":"1,088.00 €"}]
[{"v":45000.01,"d":"45,000.01 €"},{"v":1163,"d":"1,163.00 €"}]
[{"v":50000.01,"d":"50,000.01 €"},{"v":1248,"d":"1,248.00 €"}]
[{"v":65000.01,"d":"65,000.01 €"},{"v":1333,"d":"1,333.00 €"},null," "]
[{"v":80000.01,"d":"80,000.01 €"},{"v":1418,"d":"1,418.00 €"}]
[{"v":95000.01,"d":"95,000.01 €"},{"v":1503,"d":"1,503.00 €"}]
[{"v":110000.01,"d":"110,000.01 €"},{"v":1588,"d":"1,588.00 €"}]
[{"v":125000.01,"d":"125,000.01 €"},{"v":1673,"d":"1,673.00 €"}]
[{"v":140000.01,"d":"140,000.01 €"},{"v":1758,"d":"1,758.00 €"}]
[{"v":155000.01,"d":"155,000.01 €"},{"v":1843,"d":"1,843.00 €"}]
[{"v":170000.01,"d":"170,000.01 €"},{"v":1928,"d":"1,928.00 €"}]
[{"v":185000.01,"d":"185,000.01 €"},{"v":2013,"d":"2,013.00 €"}]
[{"v":200000.01,"d":"200,000.01 €"},{"v":2133,"d":"2,133.00 €"}]
[{"v":230000.01,"d":"230,000.01 €"},{"v":2253,"d":"2,253.00 €"}]
[{"v":260000.01,"d":"260,000.01 €"},{"v":2373,"d":"2,373.00 €"}]
[{"v":290000.01,"d":"290,000.01 €"},{"v":2493,"d":"2,493.00 €"}]
[{"v":320000.01,"d":"320,000.01 €"},{"v":2613,"d":"2,613.00 €"}]
[{"v":350000.01,"d":"350,000.01 €"},{"v":2733,"d":"2,733.00 €"}]
[{"v":380000.01,"d":"380,000.01 €"},{"v":2853,"d":"2,853.00 €"}]
[{"v":410000.01,"d":"410,000.01 €"},{"v":2973,"d":"2,973.00 €"}]
[{"v":440000.01,"d":"440,000.01 €"},{"v":3093,"d":"3,093.00 €"}]
[{"v":470000.01,"d":"470,000.01 €"},{"v":3213,"d":"3,213.00 €"}]
[{"v":500000.01,"d":"500,000.01 €"},{"v":3363,"d":"3,363.00 €"}]
[{"v":550000.01,"d":"550,000.01 €"},{"v":3513,"d":"3,513.00 €"}]
[{"v":600000.01,"d":"600,000.01 €"},{"v":3663,"d":"3,663.00 €"}]
[{"v":650000.01,"d":"650,000.01 €"},{"v":3813,"d":"3,813.00 €"}]
[{"v":700000.01,"d":"700,000.01 €"},{"v":3963,"d":"3,963.00 €"}]
[{"v":750000.01,"d":"750,000.01 €"},{"v":4113,"d":"4,113.00 €"}]
[{"v":800000.01,"d":"800,000.01 €"},{"v":4263,"d":"4,263.00 €"}]
[{"v":850000.01,"d":"850,000.01 €"},{"v":4413,"d":"4,413.00 €"}]
[{"v":900000.01,"d":"900,000.01 €"},{"v":4563,"d":"4,563.00 €"}]
[{"v":950000.01,"d":"950,000.01 €"},{"v":4713,"d":"4,713.00 €"}]
[{"v":1000000.01,"d":"1,000,000.01 €"},{"v":4863,"d":"4,863.00 €"}]
[{"v":1050000.01,"d":"1,050,000.01 €"},{"v":5013,"d":"5,013.00 €"}]
[{"v":1100000.01,"d":"1,100,000.01 €"},{"v":5163,"d":"5,163.00 €"}]
[{"v":1150000.01,"d":"1,150,000.01 €"},{"v":5313,"d":"5,313.00 €"}]
[{"v":1200000.01,"d":"1,200,000.01 €"},{"v":5463,"d":"5,463.00 €"}]
[{"v":1250000.01,"d":"1,250,000.01 €"},{"v":5613,"d":"5,613.00 €"}]
[{"v":1300000.01,"d":"1,300,000.01 €"},{"v":5763,"d":"5,763.00 €"}]
[{"v":1350000.01,"d":"1,350,000.01 €"},{"v":5913,"d":"5,913.00 €"}]
[{"v":1400000.01,"d":"1,400,000.01 €"},{"v":6063,"d":"6,063.00 €"}]
[{"v":1450000.01,"d":"1,450,000.01 €"},{"v":6213,"d":"6,213.00 €"}]
[{"v":1500000.01,"d":"1,500,000.01 €"},{"v":6363,"d":"6,363.00 €"}]
[{"v":1550000.01,"d":"1,550,000.01 €"},{"v":6513,"d":"6,513.00 €"}]
[{"v":1600000.01,"d":"1,600,000.01 €"},{"v":6663,"d":"6,663.00 €"}]
[{"v":1650000.01,"d":"1,650,000.01 €"},{"v":6813,"d":"6,813.00 €"}]
[{"v":1700000.01,"d":"1,700,000.01 €"},{"v":6963,"d":"6,963.00 €"}]
[{"v":1750000.01,"d":"1,750,000.01 €"},{"v":7113,"d":"7,113.00 €"}]
[{"v":1800000.01,"d":"1,800,000.01 €"},{"v":7263,"d":"7,263.00 €"}]
[{"v":1850000.01,"d":"1,850,000.01 €"},{"v":7413,"d":"7,413.00 €"}]
[{"v":1900000.01,"d":"1,900,000.01 €"},{"v":7563,"d":"7,563.00 €"}]
[{"v":1950000.01,"d":"1,950,000.01 €"},{"v":7713,"d":"7,713.00 €"}]
[{"v":2000000.01,"d":"2,000,000.01 €"},{"v":7863,"d":"7,863.00 €"}]
[{"v":2050000.01,"d":"2,050,000.01 €"},{"v":8013,"d":"8,013.00 €"}]
[{"v":2100000.01,"d":"2,100,000.01 €"},{"v":8163,"d":"8,163.00 €"}]
[{"v":2150000.01,"d":"2,150,000.01 €"},{"v":8313,"d":"8,313.00 €"}]
[{"v":2200000.01,"d":"2,200,000.01 €"},{"v":8463,"d":"8,463.00 €"}]
[{"v":2250000.01,"d":"2,250,000.01 €"},{"v":8613,"d":"8,613.00 €"}]
[{"v":2300000.01,"d":"2,300,000.01 €"},{"v":8763,"d":"8,763.00 €"}]
[{"v":2350000.01,"d":"2,350,000.01 €"},{"v":8913,"d":"8,913.00 €"}]
[{"v":2400000.01,"d":"2,400,000.01 €"},{"v":9063,"d":"9,063.00 €"}]
[{"v":2450000.01,"d":"2,450,000.01 €"},{"v":9213,"d":"9,213.00 €"}]
[{"v":2500000.01,"d":"2,500,000.01 €"},{"v":9363,"d":"9,363.00 €"}]
[{"v":2550000.01,"d":"2,550,000.01 €"},{"v":9513,"d":"9,513.00 €"}]
[{"v":2600000.01,"d":"2,600,000.01 €"},{"v":9663,"d":"9,663.00 €"}]
[{"v":2650000.01,"d":"2,650,000.01 €"},{"v":9813,"d":"9,813.00 €"}]
[{"v":2700000.01,"d":"2,700,000.01 €"},{"v":9963,"d":"9,963.00 €"}]
[{"v":2750000.01,"d":"2,750,000.01 €"},{"v":10113,"d":"10,113.00 €"}]
[{"v":2800000.01,"d":"2,800,000.01 €"},{"v":10263,"d":"10,263.00 €"}]
[{"v":2850000.01,"d":"2,850,000.01 €"},{"v":10413,"d":"10,413.00 €"}]
[{"v":2900000.01,"d":"2,900,000.01 €"},{"v":10563,"d":"10,563.00 €"}]
[{"v":2950000.01,"d":"2,950,000.01 €"},{"v":10713,"d":"10,713.00 €"}]
[{"v":3000000.01,"d":"3,000,000.01 €"},{"v":10863,"d":"10,863.00 €"}]
[{"v":3050000.01,"d":"3,050,000.01 €"},{"v":11013,"d":"11,013.00 €"}]
[{"v":3100000.01,"d":"3,100,000.01 €"},{"v":11163,"d":"11,163.00 €"}]
[{"v":3150000.01,"d":"3,150,000.01 €"},{"v":11313,"d":"11,313.00 €"}]
[{"v":3200000.01,"d":"3,200,000.01 €"},{"v":11463,"d":"11,463.00 €"}]
[{"v":3250000.01,"d":"3,250,000.01 €"},{"v":11613,"d":"11,613.00 €"}]
[{"v":3300000.01,"d":"3,300,000.01 €"},{"v":11763,"d":"11,763.00 €"}]
[{"v":3350000.01,"d":"3,350,000.01 €"},{"v":11913,"d":"11,913.00 €"}]
[{"v":3400000.01,"d":"3,400,000.01 €"},{"v":12063,"d":"12,063.00 €"}]
[{"v":3450000.01,"d":"3,450,000.01 €"},{"v":12213,"d":"12,213.00 €"}]
[{"v":3500000.01,"d":"3,500,000.01 €"},{"v":12363,"d":"12,363.00 €"}]
[{"v":3550000.01,"d":"3,550,000.01 €"},{"v":12513,"d":"12,513.00 €"}]
[{"v":3600000.01,"d":"3,600,000.01 €"},{"v":12663,"d":"12,663.00 €"}]
[{"v":3650000.01,"d":"3,650,000.01 €"},{"v":12813,"d":"12,813.00 €"}]
[{"v":3700000.01,"d":"3,700,000.01 €"},{"v":12963,"d":"12,963.00 €"}]
[{"v":3750000.01,"d":"3,750,000.01 €"},{"v":13113,"d":"13,113.00 €"}]
[{"v":3800000.01,"d":"3,800,000.01 €"},{"v":13263,"d":"13,263.00 €"}]
[{"v":3850000.01,"d":"3,850,000.01 €"},{"v":13413,"d":"13,413.00 €"}]
[{"v":3900000.01,"d":"3,900,000.01 €"},{"v":13563,"d":"13,563.00 €"}]
[{"v":3950000.01,"d":"3,950,000.01 €"},{"v":13713,"d":"13,713.00 €"}]
[{"v":4000000.01,"d":"4,000,000.01 €"},{"v":13863,"d":"13,863.00 €"}]
[{"v":4050000.01,"d":"4,050,000.01 €"},{"v":14013,"d":"14,013.00 €"}]
[{"v":4100000.01,"d":"4,100,000.01 €"},{"v":14163,"d":"14,163.00 €"}]
[{"v":4150000.01,"d":"4,150,000.01 €"},{"v":14313,"d":"14,313.00 €"}]
[{"v":4200000.01,"d":"4,200,000.01 €"},{"v":14463,"d":"14,463.00 €"}]
[{"v":4250000.01,"d":"4,250,000.01 €"},{"v":14613,"d":"14,613.00 €"}]
[{"v":4300000.01,"d":"4,300,000.01 €"},{"v":14763,"d":"14,763.00 €"}]
[{"v":4350000.01,"d":"4,350,000.01 €"},{"v":14913,"d":"14,913.00 €"}]
[{"v":4400000.01,"d":"4,400,000.01 €"},{"v":15063,"d":"15,063.00 €"}]
[{"v":4450000.01,"d":"4,450,000.01 €"},{"v":15213,"d":"15,213.00 €"}]
[{"v":4500000.01,"d":"4,500,000.01 €"},{"v":15363,"d":"15,363.00 €"}]
[{"v":4550000.01,"d":"4,550,000.01 €"},{"v":15513,"d":"15,513.00 €"}]
[{"v":4600000.01,"d":"4,600,000.01 €"},{"v":15663,"d":"15,663.00 €"}]
[{"v":4650000.01,"d":"4,650,000.01 €"},{"v":15813,"d":"15,813.00 €"}]
[{"v":4700000.01,"d":"4,700,000.01 €"},{"v":15963,"d":"15,963.00 €"}]
[{"v":4750000.01,"d":"4,750,000.01 €"},{"v":16113,"d":"16,113.00 €"}]
[{"v":4800000.01,"d":"4,800,000.01 €"},{"v":16263,"d":"16,263.00 €"}]
[{"v":4850000.01,"d":"4,850,000.01 €"},{"v":16413,"d":"16,413.00 €"}]
[{"v":4900000.01,"d":"4,900,000.01 €"},{"v":16563,"d":"16,563.00 €"}]
[{"v":4950000.01,"d":"4,950,000.01 €"},{"v":16713,"d":"16,713.00 €"}]
[{"v":5000000.01,"d":"5,000,000.01 €"},{"v":16863,"d":"16,863.00 €"}]
[{"v":5050000.01,"d":"5,050,000.01 €"},{"v":17013,"d":"17,013.00 €"}]
[{"v":5100000.01,"d":"5,100,000.01 €"},{"v":17163,"d":"17,163.00 €"}]
[{"v":5150000.01,"d":"5,150,000.01 €"},{"v":17313,"d":"17,313.00 €"}]
[{"v":5200000.01,"d":"5,200,000.01 €"},{"v":17463,"d":"17,463.00 €"}]
[{"v":5250000.01,"d":"5,250,000.01 €"},{"v":17613,"d":"17,613.00 €"}]
[{"v":5300000.01,"d":"5,300,000.01 €"},{"v":17763,"d":"17,763.00 €"}]
[{"v":5350000.01,"d":"5,350,000.01 €"},{"v":17913,"d":"17,913.00 €"}]
[{"v":5400000.01,"d":"5,400,000.01 €"},{"v":18063,"d":"18,063.00 €"}]
[{"v":5450000.01,"d":"5,450,000.01 €"},{"v":18213,"d":"18,213.00 €"}]
[{"v":5500000.01,"d":"5,500,000.01 €"},{"v":18363,"d":"18,363.00 €"}]
[{"v":5550000.01,"d":"5,550,000.01 €"},{"v":18513,"d":"18,513.00 €"}]
[{"v":5600000.01,"d":"5,600,000.01 €"},{"v":18663,"d":"18,663.00 €"}]
[{"v":5650000.01,"d":"5,650,000.01 €"},{"v":18813,"d":"18,813.00 €"}]
[{"v":5700000.01,"d":"5,700,000.01 €"},{"v":18963,"d":"18,963.00 €"}]
[{"v":5750000.01,"d":"5,750,000.01 €"},{"v":19113,"d":"19,113.00 €"}]
[{"v":5800000.01,"d":"5,800,000.01 €"},{"v":19263,"d":"19,263.00 €"}]
[{"v":5850000.01,"d":"5,850,000.01 €"},{"v":19413,"d":"19,413.00 €"}]
[{"v":5900000.01,"d":"5,900,000.01 €"},{"v":19563,"d":"19,563.00 €"}]
[{"v":5950000.01,"d":"5,950,000.01 €"},{"v":19713,"d":"19,713.00 €"}]
[{"v":6000000.01,"d":"6,000,000.01 €"},{"v":19863,"d":"19,863.00 €"}]
[{"v":6050000.01,"d":"6,050,000.01 €"},{"v":20013,"d":"20,013.00 €"}]
[{"v":6100000.01,"d":"6,100,000.01 €"},{"v":20163,"d":"20,163.00 €"}]
[{"v":6150000.01,"d":"6,150,000.01 €"},{"v":20313,"d":"20,313.00 €"}]
[{"v":6200000.01,"d":"6,200,000.01 €"},{"v":20463,"d":"20,463.00 €"}]
[{"v":6250000.01,"d":"6,250,000.01 €"},{"v":20613,"d":"20,613.00 €"}]
[{"v":6300000.01,"d":"6,300,000.01 €"},{"v":20763,"d":"20,763.00 €"}]
[{"v":6350000.01,"d":"6,350,000.01 €"},{"v":20913,"d":"20,913.00 €"}]
[{"v":6400000.01,"d":"6,400,000.01 €"},{"v":21063,"d":"21,063.00 €"}]
[{"v":6450000.01,"d":"6,450,000.01 €"},{"v":21213,"d":"21,213.00 €"}]
[{"v":6500000.01,"d":"6,500,000.01 €"},{"v":21363,"d":"21,363.00 €"}]
[{"v":6550000.01,"d":"6,550,000.01 €"},{"v":21513,"d":"21,513.00 €"}]
[{"v":6600000.01,"d":"6,600,000.01 €"},{"v":21663,"d":"21,663.00 €"}]
[{"v":6650000.01,"d":"6,650,000.01 €"},{"v":21813,"d":"21,813.00 €"}]
[{"v":6700000.01,"d":"6,700,000.01 €"},{"v":21963,"d":"21,963.00 €"}]
[{"v":6750000.01,"d":"6,750,000.01 €"},{"v":22113,"d":"22,113.00 €"}]
[{"v":6800000.01,"d":"6,800,000.01 €"},{"v":22263,"d":"22,263.00 €"}]
[{"v":6850000.01,"d":"6,850,000.01 €"},{"v":22413,"d":"22,413.00 €"}]
[{"v":6900000.01,"d":"6,900,000.01 €"},{"v":22563,"d":"22,563.00 €"}]
[{"v":6950000.01,"d":"6,950,000.01 €"},{"v":22713,"d":"22,713.00 €"}]
[{"v":7000000.01,"d":"7,000,000.01 €"},{"v":22863,"d":"22,863.00 €"}]
[{"v":7050000.01,"d":"7,050,000.01 €"},{"v":23013,"d":"23,013.00 €"}]
[{"v":7100000.01,"d":"7,100,000.01 €"},{"v":23163,"d":"23,163.00 €"}]
[{"v":7150000.01,"d":"7,150,000.01 €"},{"v":23313,"d":"23,313.00 €"}]
[{"v":7200000.01,"d":"7,200,000.01 €"},{"v":23463,"d":"23,463.00 €"}]
[{"v":7250000.01,"d":"7,250,000.01 €"},{"v":23613,"d":"23,613.00 €"}]
[{"v":7300000.01,"d":"7,300,000.01 €"},{"v":23763,"d":"23,763.00 €"}]
[{"v":7350000.01,"d":"7,350,000.01 €"},{"v":23913,"d":"23,913.00 €"}]
[{"v":7400000.01,"d":"7,400,000.01 €"},{"v":24063,"d":"24,063.00 €"}]
[{"v":7450000.01,"d":"7,450,000.01 €"},{"v":24213,"d":"24,213.00 €"}]
[{"v":7500000.01,"d":"7,500,000.01 €"},{"v":24363,"d":"24,363.00 €"}]
[{"v":7550000.01,"d":"7,550,000.01 €"},{"v":24513,"d":"24,513.00 €"}]
[{"v":7600000.01,"d":"7,600,000.01 €"},{"v":24663,"d":"24,663.00 €"}]
[{"v":7650000.01,"d":"7,650,000.01 €"},{"v":24813,"d":"24,813.00 €"}]
[{"v":7700000.01,"d":"7,700,000.01 €"},{"v":24963,"d":"24,963.00 €"}]
[{"v":7750000.01,"d":"7,750,000.01 €"},{"v":25113,"d":"25,113.00 €"}]
[{"v":7800000.01,"d":"7,800,000.01 €"},{"v":25263,"d":"25,263.00 €"}]
[{"v":7850000.01,"d":"7,850,000.01 €"},{"v":25413,"d":"25,413.00 €"}]
[{"v":7900000.01,"d":"7,900,000.01 €"},{"v":25563,"d":"25,563.00 €"}]
[{"v":7950000.01,"d":"7,950,000.01 €"},{"v":25713,"d":"25,713.00 €"}]
[{"v":8000000.01,"d":"8,000,000.01 €"},{"v":25863,"d":"25,863.00 €"}]
[{"v":8050000.01,"d":"8,050,000.01 €"},{"v":26013,"d":"26,013.00 €"}]
[{"v":8100000.01,"d":"8,100,000.01 €"},{"v":26163,"d":"26,163.00 €"}]
[{"v":8150000.01,"d":"8,150,000.01 €"},{"v":26313,"d":"26,313.00 €"}]
[{"v":8200000.01,"d":"8,200,000.01 €"},{"v":26463,"d":"26,463.00 €"}]
[{"v":8250000.01,"d":"8,250,000.01 €"},{"v":26613,"d":"26,613.00 €"}]
[{"v":8300000.01,"d":"8,300,000.01 €"},{"v":26763,"d":"26,763.00 €"}]
[{"v":8350000.01,"d":"8,350,000.01 €"},{"v":26913,"d":"26,913.00 €"}]
[{"v":8400000.01,"d":"8,400,000.01 €"},{"v":27063,"d":"27,063.00 €"}]
[{"v":8450000.01,"d":"8,450,000.01 €"},{"v":27213,"d":"27,213.00 €"}]
[{"v":8500000.01,"d":"8,500,000.01 €"},{"v":27363,"d":"27,363.00 €"}]
[{"v":8550000.01,"d":"8,550,000.01 €"},{"v":27513,"d":"27,513.00 €"}]
[{"v":8600000.01,"d":"8,600,000.01 €"},{"v":27663,"d":"27,663.00 €"}]
[{"v":8650000.01,"d":"8,650,000.01 €"},{"v":27813,"d":"27,813.00 €"}]
[{"v":8700000.01,"d":"8,700,000.01 €"},{"v":27963,"d":"27,963.00 €"}]
[{"v":8750000.01,"d":"8,750,000.01 €"},{"v":28113,"d":"28,113.00 €"}]
[{"v":8800000.01,"d":"8,800,000.01 €"},{"v":28263,"d":"28,263.00 €"}]
[{"v":8850000.01,"d":"8,850,000.01 €"},{"v":28413,"d":"28,413.00 €"}]
[{"v":8900000.01,"d":"8,900,000.01 €"},{"v":28563,"d":"28,563.00 €"}]
[{"v":8950000.01,"d":"8,950,000.01 €"},{"v":28713,"d":"28,713.00 €"}]
[{"v":9000000.01,"d":"9,000,000.01 €"},{"v":28863,"d":"28,863.00 €"}]
[{"v":9050000.01,"d":"9,050,000.01 €"},{"v":29013,"d":"29,013.00 €"}]
[{"v":9100000.01,"d":"9,100,000.01 €"},{"v":29163,"d":"29,163.00 €"}]
[{"v":9150000.01,"d":"9,150,000.01 €"},{"v":29313,"d":"29,313.00 €"}]
[{"v":9200000.01,"d":"9,200,000.01 €"},{"v":29463,"d":"29,463.00 €"}]
[{"v":9250000.01,"d":"9,250,000.01 €"},{"v":29613,"d":"29,613.00 €"}]
[{"v":9300000.01,"d":"9,300,000.01 €"},{"v":29763,"d":"29,763.00 €"}]
[{"v":9350000.01,"d":"9,350,000.01 €"},{"v":29913,"d":"29,913.00 €"}]
[{"v":9400000.01,"d":"9,400,000.01 €"},{"v":30063,"d":"30,063.00 €"}]
[{"v":9450000.01,"d":"9,450,000.01 €"},{"v":30213,"d":"30,213.00 €"}]
[{"v":9500000.01,"d":"9,500,000.01 €"},{"v":30363,"d":"30,363.00 €"}]
[{"v":9550000.01,"d":"9,550,000.01 €"},{"v":30513,"d":"30,513.00 €"}]
[{"v":9600000.01,"d":"9,600,000.01 €"},{"v":30663,"d":"30,663.00 €"}]
[{"v":9650000.01,"d":"9,650,000.01 €"},{"v":30813,"d":"30,813.00 €"}]
[{"v":9700000.01,"d":"9,700,000.01 €"},{"v":30963,"d":"30,963.00 €"}]
[{"v":9750000.01,"d":"9,750,000.01 €"},{"v":31113,"d":"31,113.00 €"}]
[{"v":9800000.01,"d":"9,800,000.01 €"},{"v":31263,"d":"31,263.00 €"}]
[{"v":9850000.01,"d":"9,850,000.01 €"},{"v":31413,"d":"31,413.00 €"}]
[{"v":9900000.01,"d":"9,900,000.01 €"},{"v":31563,"d":"31,563.00 €"}]
[{"v":9950000.01,"d":"9,950,000.01 €"},{"v":31713,"d":"31,713.00 €"}]
[{"v":10000000.01,"d":"10,000,000.01 €"},{"v":31863,"d":"31,863.00 €"}]
[{"v":10050000.01,"d":"10,050,000.01 €"},{"v":32013,"d":"32,013.00 €"}]
[{"v":10100000.01,"d":"10,100,000.01 €"},{"v":32163,"d":"32,163.00 €"}]
[{"v":10150000.01,"d":"10,150,000.01 €"},{"v":32313,"d":"32,313.00 €"}]
[{"v":10200000.01,"d":"10,200,000.01 €"},{"v":32463,"d":"32,463.00 €"}]
[{"v":10250000.01,"d":"10,250,000.01 €"},{"v":32613,"d":"32,613.00 €"}]
[{"v":10300000.01,"d":"10,300,000.01 €"},{"v":32763,"d":"32,763.00 €"}]
[{"v":10350000.01,"d":"10,350,000.01 €"},{"v":32913,"d":"32,913.00 €"}]
[{"v":10400000.01,"d":"10,400,000.01 €"},{"v":33063,"d":"33,063.00 €"}]
[{"v":10450000.01,"d":"10,450,000.01 €"},{"v":33213,"d":"33,213.00 €"}]
[{"v":10500000.01,"d":"10,500,000.01 €"},{"v":33363,"d":"33,363.00 €"}]
[{"v":10550000.01,"d":"10,550,000.01 €"},{"v":33513,"d":"33,513.00 €"}]
[{"v":10600000.01,"d":"10,600,000.01 €"},{"v":33663,"d":"33,663.00 €"}]
[{"v":10650000.01,"d":"10,650,000.01 €"},{"v":33813,"d":"33,813.00 €"}]
[{"v":10700000.01,"d":"10,700,000.01 €"},{"v":33963,"d":"33,963.00 €"}]
[{"v":10750000.01,"d":"10,750,000.01 €"},{"v":34113,"d":"34,113.00 €"}]
[{"v":10800000.01,"d":"10,800,000.01 €"},{"v":34263,"d":"34,263.00 €"}]
[{"v":10850000.01,"d":"10,850,000.01 €"},{"v":34413,"d":"34,413.00 €"}]

{"sheet":"§ 49 RVG","index":2,"n_rows":19,"n_cols":2,"rows_kept":19,"hidden":true}
[{"v":0,"d":"0.00 €"},{"v":45,"d":"45.00 €"}]
[{"v":500.01,"d":"500.01 €"},{"v":80,"d":"80.00 €"}]
[{"v":1000.01,"d":"1,000.01 €"},{"v":115,"d":"115.00 €"}]
[{"v":1500.01,"d":"1,500.01 €"},{"v":150,"d":"150.00 €"}]
[{"v":2000.01,"d":"2,000.01 €"},{"v":201,"d":"201.00 €"}]
[{"v":3000.01,"d":"3,000.01 €"},{"v":252,"d":"252.00 €"}]
[{"v":4000.01,"d":"4,000.01 €"},{"v":257,"d":"257.00 €"}]
[{"v":5000.01,"d":"5,000.01 €"},{"v":267,"d":"267.00 €"}]
[{"v":6000.01,"d":"6,000.01 €"},{"v":277,"d":"277.00 €"}]
[{"v":7000.01,"d":"7,000.01 €"},{"v":287,"d":"287.00 €"}]
[{"v":8000.01,"d":"8,000.01 €"},{"v":297,"d":"297.00 €"}]
[{"v":9000.01,"d":"9,000.01 €"},{"v":307,"d":"307.00 €"}]
[{"v":10000.01,"d":"10,000.01 €"},{"v":321,"d":"321.00 €"}]
[{"v":13000.01,"d":"13,000.01 €"},{"v":335,"d":"335.00 €"}]
[{"v":16000.01,"d":"16,000.01 €"},{"v":349,"d":"349.00 €"}]
[{"v":19000.01,"d":"19,000.01 €"},{"v":363,"d":"363.00 €"}]
[{"v":22000.01,"d":"22,000.01 €"},{"v":377,"d":"377.00 €"}]
[{"v":25000.01,"d":"25,000.01 €"},{"v":412,"d":"412.00 €"}]
[{"v":30000.01,"d":"30,000.01 €"},{"v":447,"d":"447.00 €"}]